Reaction Details
TargetAcetylcholinesterase
LigandBDBM8969
Substrate/Competitorn/a
Meas. Tech.ChEMBL_27955 (CHEMBL649135)
Ki 1500±n/a nM
Citation Savini, LGaeta, AFattorusso, CCatalanotti, BCampiani, GChiasserini, LPellerano, CNovellino, EMcKissic, DSaxena, A Specific targeting of acetylcholinesterase and butyrylcholinesterase recognition sites. Rational design of novel, selective, and highly potent cholinesterase inhibitors. J Med Chem46:1-4 (2002) 
 
Acetylcholinesterase
Name:Acetylcholinesterase
Type:Enzyme
Mol. Mass.:67659.62
Organism:Bos taurus (bovine)
Description:n/a
Residue:613
BDBM8969
NameBDBM8969
Synonyms:CHEMBL131410 Tacrine Dimer 4e
TypeSmall organic molecule
Emp. Form.C34H41N5O
Mol. Mass.535.7222
SMILESCC(=O)N(CCCNc1c2CCCCc2nc2ccccc12)CCCNc1c2CCCCc2nc2ccccc12