Reaction Details
TargetAcetylcholinesterase
LigandBDBM10516
Substrate/Competitorn/a
Meas. Tech.ChEMBL_27955 (CHEMBL649135)
Ki 1±n/a nM
Citation Savini, LGaeta, AFattorusso, CCatalanotti, BCampiani, GChiasserini, LPellerano, CNovellino, EMcKissic, DSaxena, A Specific targeting of acetylcholinesterase and butyrylcholinesterase recognition sites. Rational design of novel, selective, and highly potent cholinesterase inhibitors. J Med Chem46:1-4 (2002) 
 
Acetylcholinesterase
Name:Acetylcholinesterase
Type:Enzyme
Mol. Mass.:67659.62
Organism:Bos taurus (bovine)
Description:n/a
Residue:613
BDBM10516
NameBDBM10516
Synonyms:6,8-dichloro-1,2,3,4-tetrahydroacridin-9-amine Tacrine deriv. 2
Typen/a
Emp. Form.C13H12Cl2N2
Mol. Mass.267.154
SMILESNc1c2CCCCc2nc2cc(Cl)cc(Cl)c12