Reaction Details
TargetCholinesterase
LigandBDBM10518
Substrate/Competitorn/a
Meas. Tech.ChEMBL_41269 (CHEMBL655026)
Ki>20000±n/a nM
Citation Savini, LGaeta, AFattorusso, CCatalanotti, BCampiani, GChiasserini, LPellerano, CNovellino, EMcKissic, DSaxena, A Specific targeting of acetylcholinesterase and butyrylcholinesterase recognition sites. Rational design of novel, selective, and highly potent cholinesterase inhibitors. J Med Chem46:1-4 (2002) 
 
Cholinesterase
Name:Cholinesterase
Type:Homotetramer
Mol. Mass.:68422.27
Organism:Homo sapiens (Human)
Description:P06276
Residue:602
BDBM10518
NameBDBM10518
Synonyms:6,8-dichloro-N-{7-[(6,8-dichloro-1,2,3,4-tetrahydroacridin-9-yl)amino]heptyl}-1,2,3,4-tetrahydroacridin-9-amine tacrine homobivalent compound 3b
TypeSmall organic molecule
Emp. Form.C33H36Cl4N4
Mol. Mass.630.478
SMILESClc1cc(Cl)c2c(NCCCCCCCNc3c4CCCCc4nc4cc(Cl)cc(Cl)c34)c3CCCCc3nc2c1