Reaction Details
TargetCholinesterase
LigandBDBM50369748
Substrate/Competitorn/a
Meas. Tech.ChEMBL_41438 (CHEMBL654417)
Ki 120±n/a nM
Citation Savini, LGaeta, AFattorusso, CCatalanotti, BCampiani, GChiasserini, LPellerano, CNovellino, EMcKissic, DSaxena, A Specific targeting of acetylcholinesterase and butyrylcholinesterase recognition sites. Rational design of novel, selective, and highly potent cholinesterase inhibitors. J Med Chem46:1-4 (2002) 
 
Cholinesterase
Name:Cholinesterase
Type:Homotetramer
Mol. Mass.:68422.27
Organism:Homo sapiens (Human)
Description:P06276
Residue:602
BDBM50369748
NameBDBM50369748
Synonyms:CHEMBL208599
TypeSmall organic molecule
Emp. Form.C18H19ClN2
Mol. Mass.298.81
SMILESCCC1=CC2C[C@H](C1)c1c(C2)nc2cc(Cl)ccc2c1N