Reaction Details
TargetBeta-2 adrenergic receptor
LigandBDBM50122648
Substrate/Competitorn/a
Meas. Tech.ChEMBL_38615 (CHEMBL857081)
IC50 6457±n/a nM
Citation Tanaka, NTamai, TMukaiyama, HHirabayashi, AMuranaka, HIshikawa, TKobayashi, JAkahane, SAkahane, M Relationship between stereochemistry and the beta3-adrenoceptor agonistic activity of 4'-hydroxynorephedrine derivative as an agent for treatment of frequent urination and urinary incontinence. J Med Chem46:105-12 (2002) 
 
Beta-2 adrenergic receptor
Name:Beta-2 adrenergic receptor
Type:PROTEIN
Mol. Mass.:46593.67
Organism:Canis familiaris
Description:ChEMBL_56504
Residue:415
BDBM50122648
NameBDBM50122648
Synonyms:(alphaS,betaR)(2-Chloro-4-{2-[2-hydroxy-2-(4-hydroxy-phenyl)-1-methyl-ethylamino]-ethyl}-phenoxy)-acetic acid | CHEMBL13560
TypeSmall organic molecule
Emp. Form.C19H22ClNO5
Mol. Mass.379.835
SMILESC[C@@H](NCCc1ccc(OCC(O)=O)c(Cl)c1)[C@@H](O)c1ccc(O)cc1