Reaction Details
TargetGonadotropin-releasing hormone receptor
LigandBDBM50122656
Substrate/Competitorn/a
Meas. Tech.ChEMBL_100011 (CHEMBL709249)
IC50 0.3±n/a nM
Citation Sasaki, SCho, NNara, YHarada, MEndo, SSuzuki, NFuruya, SFujino, M Discovery of a thieno[2,3-d]pyrimidine-2,4-dione bearing a p-methoxyureidophenyl moiety at the 6-position: a highly potent and orally bioavailable non-peptide antagonist for the human luteinizing hormone-releasing hormone receptor. J Med Chem46:113-24 (2002) 
 
Gonadotropin-releasing hormone receptor
Name:Gonadotropin-releasing hormone receptor
Type:Enzyme
Mol. Mass.:37749.45
Organism:Homo sapiens (Human)
Description:P30968
Residue:328
BDBM50122656
NameBDBM50122656
Synonyms:CHEMBL280365 | N-{4-[5-[(Benzyl-methyl-amino)-methyl]-1-(2,6-difluoro-benzyl)-3-(3-methoxy-phenyl)-2,4-dioxo-1,2,3,4-tetrahydro-thieno[2,3-d]pyrimidin-6-yl]-phenyl}-isobutyramide; HCL.H2O
TypeSmall organic molecule
Emp. Form.C39H36F2N4O4S
Mol. Mass.694.789
SMILESCOc1cccc(c1)-n1c(=O)n(Cc2c(F)cccc2F)c2sc(c(CN(C)Cc3ccccc3)c2c1=O)-c1ccc(NC(=O)C(C)C)cc1