Reaction Details
TargetGonadotropin-releasing hormone receptor
LigandBDBM50122661
Substrate/Competitorn/a
Meas. Tech.ChEMBL_100011 (CHEMBL709249)
IC50 0.6±n/a nM
Citation Sasaki, SCho, NNara, YHarada, MEndo, SSuzuki, NFuruya, SFujino, M Discovery of a thieno[2,3-d]pyrimidine-2,4-dione bearing a p-methoxyureidophenyl moiety at the 6-position: a highly potent and orally bioavailable non-peptide antagonist for the human luteinizing hormone-releasing hormone receptor. J Med Chem46:113-24 (2002) 
 
Gonadotropin-releasing hormone receptor
Name:Gonadotropin-releasing hormone receptor
Type:Enzyme
Mol. Mass.:37749.45
Organism:Homo sapiens (Human)
Description:P30968
Residue:328
BDBM50122661
NameBDBM50122661
Synonyms:1-{4-[5-[(Benzyl-methyl-amino)-methyl]-1-(2,6-difluoro-benzyl)-2,4-dioxo-3-phenyl-1,2,3,4-tetrahydro-thieno[2,3-d]pyrimidin-6-yl]-phenyl}-3-isopropoxy-urea; HCL.0.5 H2O | CHEMBL21936
TypeSmall organic molecule
Emp. Form.C38H35F2N5O4S
Mol. Mass.695.777
SMILESCC(C)ONC(=O)Nc1ccc(cc1)-c1sc2n(Cc3c(F)cccc3F)c(=O)n(-c3ccccc3)c(=O)c2c1CN(C)Cc1ccccc1