Reaction Details
TargetGonadotropin-releasing hormone receptor
LigandBDBM50067485
Substrate/Competitorn/a
Meas. Tech.ChEMBL_100011 (CHEMBL709249)
IC50 0.2±n/a nM
Citation Sasaki, SCho, NNara, YHarada, MEndo, SSuzuki, NFuruya, SFujino, M Discovery of a thieno[2,3-d]pyrimidine-2,4-dione bearing a p-methoxyureidophenyl moiety at the 6-position: a highly potent and orally bioavailable non-peptide antagonist for the human luteinizing hormone-releasing hormone receptor. J Med Chem46:113-24 (2002) 
 
Gonadotropin-releasing hormone receptor
Name:Gonadotropin-releasing hormone receptor
Type:Enzyme
Mol. Mass.:37749.45
Organism:Homo sapiens (Human)
Description:P30968
Residue:328
BDBM50067485
NameBDBM50067485
Synonyms:3-[(Benzyl-methyl-amino)-methyl]-7-(2,6-difluoro-benzyl)-2-(4-isobutyrylamino-phenyl)-4-oxo-4,7-dihydro-thieno[2,3-b]pyridine-5-carboxylic acid isopropyl ester; hydrochloride CHEMBL71917 | T-98475
TypeSmall organic molecule
Emp. Form.C37H37F2N3O4S
Mol. Mass.657.769
SMILESCC(C)OC(=O)c1cn(Cc2c(F)cccc2F)c2sc(c(CN(C)Cc3ccccc3)c2c1=O)-c1ccc(NC(=O)C(C)C)cc1