Reaction Details
TargetEndothelin receptor type B
LigandBDBM50122694
Substrate/Competitorn/a
Meas. Tech.ChEMBL_63850 (CHEMBL673234)
Ki 270±n/a nM
Citation Murugesan, NGu, ZSpergel, SYoung, MChen, PMathur, ALeith, LHermsmeier, MLiu, ECZhang, RBird, EWaldron, TMarino, AKoplowitz, BHumphreys, WGChong, SMorrison, RAWebb, MLMoreland, STrippodo, NBarrish, JC Biphenylsulfonamide endothelin receptor antagonists. 4. Discovery of N-[[2'-[[(4,5-dimethyl-3-isoxazolyl)amino]sulfonyl]-4-(2-oxazolyl)[1,1'-biphenyl]- 2-yl]methyl]-N,3,3-trimethylbutanamide (BMS-207940), a highly potent and orally active ET(A) selective antagonist. J Med Chem46:125-37 (2002) 
 
Endothelin receptor type B
Name:Endothelin receptor type B
Type:Enzyme Catalytic Domain
Mol. Mass.:49664.00
Organism:Homo sapiens (Human)
Description:ENDOTHELIN B EDNRB HUMAN::P24530
Residue:442
BDBM50122694
NameBDBM50122694
Synonyms:2'-(3,3-Dimethyl-2-oxo-pyrrolidin-1-ylmethyl)-4'-oxazol-2-yl-biphenyl-2-sulfonic acid (3,4-dimethyl-isoxazol-5-yl)-amide | CHEMBL29972
TypeSmall organic molecule
Emp. Form.C27H28N4O5S
Mol. Mass.520.6
SMILESCc1noc(NS(=O)(=O)c2ccccc2-c2ccc(cc2CN2CCC(C)(C)C2=O)-c2ncco2)c1C