Reaction Details
TargetEndothelin-1 receptor
LigandBDBM50122702
Substrate/Competitorn/a
Meas. Tech.ChEMBL_65652 (CHEMBL678072)
Ki 0.6±n/a nM
Citation Murugesan, NGu, ZSpergel, SYoung, MChen, PMathur, ALeith, LHermsmeier, MLiu, ECZhang, RBird, EWaldron, TMarino, AKoplowitz, BHumphreys, WGChong, SMorrison, RAWebb, MLMoreland, STrippodo, NBarrish, JC Biphenylsulfonamide endothelin receptor antagonists. 4. Discovery of N-[[2'-[[(4,5-dimethyl-3-isoxazolyl)amino]sulfonyl]-4-(2-oxazolyl)[1,1'-biphenyl]- 2-yl]methyl]-N,3,3-trimethylbutanamide (BMS-207940), a highly potent and orally active ET(A) selective antagonist. J Med Chem46:125-37 (2002) 
 
Endothelin-1 receptor
Name:Endothelin-1 receptor
Type:Enzyme Catalytic Domain
Mol. Mass.:48736.88
Organism:Homo sapiens (Human)
Description:P25101
Residue:427
BDBM50122702
NameBDBM50122702
Synonyms:CHEMBL30215 | N-tert-Butyl-2-[2'-(3,4-dimethyl-isoxazol-5-ylsulfamoyl)-4-oxazol-2-yl-biphenyl-2-yl]-acetamide
TypeSmall organic molecule
Emp. Form.C26H28N4O5S
Mol. Mass.508.589
SMILESCc1noc(NS(=O)(=O)c2ccccc2-c2ccc(cc2CC(=O)NC(C)(C)C)-c2ncco2)c1C