Reaction Details
TargetEndothelin receptor type B
LigandBDBM50122676
Substrate/Competitorn/a
Meas. Tech.ChEMBL_63850 (CHEMBL673234)
Ki 810±n/a nM
Citation Murugesan, NGu, ZSpergel, SYoung, MChen, PMathur, ALeith, LHermsmeier, MLiu, ECZhang, RBird, EWaldron, TMarino, AKoplowitz, BHumphreys, WGChong, SMorrison, RAWebb, MLMoreland, STrippodo, NBarrish, JC Biphenylsulfonamide endothelin receptor antagonists. 4. Discovery of N-[[2'-[[(4,5-dimethyl-3-isoxazolyl)amino]sulfonyl]-4-(2-oxazolyl)[1,1'-biphenyl]- 2-yl]methyl]-N,3,3-trimethylbutanamide (BMS-207940), a highly potent and orally active ET(A) selective antagonist. J Med Chem46:125-37 (2002) 
 
Endothelin receptor type B
Name:Endothelin receptor type B
Type:Enzyme Catalytic Domain
Mol. Mass.:49664.00
Organism:Homo sapiens (Human)
Description:ENDOTHELIN B EDNRB HUMAN::P24530
Residue:442
BDBM50122676
NameBDBM50122676
Synonyms:CHEMBL274489 | N-[2'-(4,5-Dimethyl-isoxazol-3-ylsulfamoyl)-4-oxazol-2-yl-biphenyl-2-yl]-3,3,N-trimethyl-butyramide
TypeSmall organic molecule
Emp. Form.C27H30N4O5S
Mol. Mass.522.616
SMILESCN(C(=O)CC(C)(C)C)c1cc(ccc1-c1ccccc1S(=O)(=O)Nc1noc(C)c1C)-c1ncco1