Reaction Details
TargetD(2) dopamine receptor
LigandBDBM50122736
Substrate/Competitorn/a
Meas. Tech.ChEMBL_59633 (CHEMBL672423)
Ki 5±n/a nM
Citation Macchia, MCervetto, LDemontis, GCLongoni, BMinutolo, FOrlandini, EOrtore, GPapi, CSbrana, AMacchia, B New N-n-propyl-substituted 3-aryl- and 3-cyclohexylpiperidines as partial agonists at the D4 dopamine receptor. J Med Chem46:161-8 (2002) 
 
D(2) dopamine receptor
Name:D(2) dopamine receptor
Type:Enzyme Catalytic Domain
Mol. Mass.:50698.79
Organism:BOVINE
Description:P20288
Residue:444
BDBM50122736
NameBDBM50122736
Synonyms:3-(3-Methyl-cyclohexyl)-1-propyl-piperidine; hydrochloride | CHEMBL545188
TypeSmall organic molecule
Emp. Form.C15H29N
Mol. Mass.223.3975
SMILESCCCN1CCCC(C1)C1CCCC(C)C1