Reaction Details
TargetDelta-type opioid receptor
LigandBDBM50122553
Substrate/Competitorn/a
Meas. Tech.ChEMBL_145336 (CHEMBL750571)
IC50>10000±n/a nM
Citation Hanessian, SParthasarathy, SMauduit, MPayza, K The power of visual imagery in drug design. Isopavines as a new class of morphinomimetics and their human opioid receptor binding activity. J Med Chem46:34-48 (2002) 
 
Delta-type opioid receptor
Name:Delta-type opioid receptor
Type:G Protein-Coupled Receptor (GPCR)
Mol. Mass.:40382.98
Organism:Homo sapiens (Human)
Description:Competition binding assays were carried out using membrane preparations from transfected HN9.10 cells that constitutively expressed the delta opioid receptor.
Residue:372
BDBM50122553
NameBDBM50122553
Synonyms:4,13-dimethoxy-16,17-dimethyl-17-azatetracyclo[7.6.2.02,7.010,15]heptadeca-2(7),3,5,12,14-pentaene
TypeSmall organic molecule
Emp. Form.C20H25NO2
Mol. Mass.311.418
SMILESCOC1=CC[C@H]2[C@@H]3Cc4ccc(OC)cc4[C@H]([C@@H](C)N3C)C2=C1