Reaction Details
TargetMu-type opioid receptor
LigandBDBM50122523
Substrate/Competitorn/a
Meas. Tech.ChEMBL_145593 (CHEMBL749738)
EC50 4300±n/a nM
Citation Hanessian, SParthasarathy, SMauduit, MPayza, K The power of visual imagery in drug design. Isopavines as a new class of morphinomimetics and their human opioid receptor binding activity. J Med Chem46:34-48 (2002) 
 
Mu-type opioid receptor
Name:Mu-type opioid receptor
Type:G Protein-Coupled Receptor (GPCR)
Mol. Mass.:44789.51
Organism:Homo sapiens (Human)
Description:P35372
Residue:400
BDBM50122523
NameBDBM50122523
Synonyms:4N,13N-dibenzyl-16,17-dimethyl-17-azatetracyclo[7.6.2.02,7.010,15]heptadeca-2(7),3,5,12,14-pentaene-4,13-diamine
TypeSmall organic molecule
Emp. Form.C32H35N3
Mol. Mass.461.6404
SMILESC[C@@H]1[C@@H]2C3=CC(CC[C@H]3[C@H](Cc3ccc(NCc4ccccc4)cc23)N1C)=NCc1ccccc1