Reaction Details
TargetKappa-type opioid receptor
LigandBDBM50027010
Substrate/Competitorn/a
Meas. Tech.ChEMBL_145111 (CHEMBL751994)
IC50>10000±n/a nM
Citation Hanessian, SParthasarathy, SMauduit, MPayza, K The power of visual imagery in drug design. Isopavines as a new class of morphinomimetics and their human opioid receptor binding activity. J Med Chem46:34-48 (2002) 
 
Kappa-type opioid receptor
Name:Kappa-type opioid receptor
Type:G Protein-Coupled Receptor (GPCR)
Mol. Mass.:42648.76
Organism:Homo sapiens (Human)
Description:P41145
Residue:380
BDBM50027010
NameBDBM50027010
Synonyms:CHEMBL2112838
TypeSmall organic molecule
Emp. Form.C18H19N
Mol. Mass.249.3502
SMILES[H][C@@]12Cc3ccccc3[C@@]([H])(c3ccccc13)[C@]([H])(C)N2C