Reaction Details
TargetDelta-type opioid receptor
LigandBDBM50122526
Substrate/Competitorn/a
Meas. Tech.ChEMBL_145336 (CHEMBL750571)
IC50 3300±n/a nM
Citation Hanessian, SParthasarathy, SMauduit, MPayza, K The power of visual imagery in drug design. Isopavines as a new class of morphinomimetics and their human opioid receptor binding activity. J Med Chem46:34-48 (2002) 
 
Delta-type opioid receptor
Name:Delta-type opioid receptor
Type:G Protein-Coupled Receptor (GPCR)
Mol. Mass.:40382.98
Organism:Homo sapiens (Human)
Description:Competition binding assays were carried out using membrane preparations from transfected HN9.10 cells that constitutively expressed the delta opioid receptor.
Residue:372
BDBM50122526
NameBDBM50122526
Synonyms:17-cyclopropylmethyl-16-methyl-13-methylcarbonyloxy-17-azatetracyclo[7.6.2.02,7.010,15]heptadeca-2(7),3,5,12,14-pentaen-4-yl acetate
TypeSmall organic molecule
Emp. Form.C25H29NO4
Mol. Mass.407.5021
SMILESC[C@@H]1[C@@H]2C3=CC(OC(C)=O)=CC[C@H]3[C@H](Cc3ccc(OC(C)=O)cc23)N1CC1CC1