Reaction Details
TargetKappa-type opioid receptor
LigandBDBM50122539
Substrate/Competitorn/a
Meas. Tech.ChEMBL_145111 (CHEMBL751994)
IC50>10000±n/a nM
Citation Hanessian, SParthasarathy, SMauduit, MPayza, K The power of visual imagery in drug design. Isopavines as a new class of morphinomimetics and their human opioid receptor binding activity. J Med Chem46:34-48 (2002) 
 
Kappa-type opioid receptor
Name:Kappa-type opioid receptor
Type:G Protein-Coupled Receptor (GPCR)
Mol. Mass.:42648.76
Organism:Homo sapiens (Human)
Description:P41145
Residue:380
BDBM50122539
NameBDBM50122539
Synonyms:4,13-dimethoxy-20-azapentacyclo[7.6.5.02,7.010,15.016,20]icosa-2(7),3,5,12,14-pentaene
TypeSmall organic molecule
Emp. Form.C21H25NO2
Mol. Mass.323.4287
SMILESCOC1=CC[C@H]2[C@@H]3Cc4ccc(OC)cc4[C@H]([C@@H]4CCCN34)C2=C1