Reaction Details
TargetKappa-type opioid receptor
LigandBDBM50122550
Substrate/Competitorn/a
Meas. Tech.ChEMBL_145111 (CHEMBL751994)
IC50 1200±n/a nM
Citation Hanessian, SParthasarathy, SMauduit, MPayza, K The power of visual imagery in drug design. Isopavines as a new class of morphinomimetics and their human opioid receptor binding activity. J Med Chem46:34-48 (2002) 
 
Kappa-type opioid receptor
Name:Kappa-type opioid receptor
Type:G Protein-Coupled Receptor (GPCR)
Mol. Mass.:42648.76
Organism:Homo sapiens (Human)
Description:P41145
Residue:380
BDBM50122550
NameBDBM50122550
Synonyms:4N,13N-diphenyl-17-cyclopropylmethyl-16-methyl-(9S,16R)-17-azatetracyclo[7.6.2.02,7.010,15]heptadeca-2(7),3,5,12,14-pentaene-4,13-diamine
TypeSmall organic molecule
Emp. Form.C33H35N3
Mol. Mass.473.6511
SMILESC[C@@H]1[C@@H]2C3=CC(CC[C@H]3[C@H](Cc3ccc(Nc4ccccc4)cc23)N1CC1CC1)=Nc1ccccc1