Reaction Details
TargetKappa-type opioid receptor
LigandBDBM50122521
Substrate/Competitorn/a
Meas. Tech.ChEMBL_145111 (CHEMBL751994)
IC50 1600±n/a nM
Citation Hanessian, SParthasarathy, SMauduit, MPayza, K The power of visual imagery in drug design. Isopavines as a new class of morphinomimetics and their human opioid receptor binding activity. J Med Chem46:34-48 (2002) 
 
Kappa-type opioid receptor
Name:Kappa-type opioid receptor
Type:G Protein-Coupled Receptor (GPCR)
Mol. Mass.:42648.76
Organism:Homo sapiens (Human)
Description:P41145
Residue:380
BDBM50122521
NameBDBM50122521
Synonyms:17-cyclopropylmethyl-16-methyl-4,13-di(4-methylhexahydro-1-pyrazinyl)-(16R)-17-azatetracyclo[7.6.2.02,7.010,15]heptadeca-2(7),3,5,12,14-pentaene
TypeSmall organic molecule
Emp. Form.C31H45N5
Mol. Mass.487.7225
SMILESC[C@@H]1[C@@H]2C3=CC(=CC[C@H]3[C@H](Cc3ccc(cc23)N2CCN(C)CC2)N1CC1CC1)N1CCN(C)CC1