Reaction Details
TargetReceptor tyrosine-protein kinase erbB-2
LigandBDBM50122578
Substrate/Competitorn/a
Meas. Tech.ChEMBL_161599 (CHEMBL769139)
IC50 180±n/a nM
Citation Wissner, AOverbeek, EReich, MFFloyd, MBJohnson, BDMamuya, NRosfjord, ECDiscafani, CDavis, RShi, XRabindran, SKGruber, BCYe, FHallett, WANilakantan, RShen, RWang, YFGreenberger, LMTsou, HR Synthesis and structure-activity relationships of 6,7-disubstituted 4-anilinoquinoline-3-carbonitriles. The design of an orally active, irreversible inhibitor of the tyrosine kinase activity of the epidermal growth factor receptor (EGFR) and the human epidermal growth factor receptor-2 (HER-2). J Med Chem46:49-63 (2002) 
 
Receptor tyrosine-protein kinase erbB-2
Name:Receptor tyrosine-protein kinase erbB-2
Type:n/a
Mol. Mass.:137894.47
Organism:Homo sapiens (Human)
Description:P04626
Residue:1255
BDBM50122578
NameBDBM50122578
Synonyms:4-Dimethylamino-but-2-ynoic acid [4-(3-bromo-phenylamino)-3-cyano-7-methoxy-quinolin-6-yl]-amide | CHEMBL116853
TypeSmall organic molecule
Emp. Form.C23H20BrN5O2
Mol. Mass.478.341
SMILESCOc1cc2ncc(C#N)c(Nc3cccc(Br)c3)c2cc1NC(=O)C#CCN(C)C