Reaction Details
TargetEpidermal growth factor receptor
LigandBDBM50122580
Substrate/Competitorn/a
Meas. Tech.ChEMBL_66597 (CHEMBL680028)
IC50 2700±n/a nM
Citation Wissner, AOverbeek, EReich, MFFloyd, MBJohnson, BDMamuya, NRosfjord, ECDiscafani, CDavis, RShi, XRabindran, SKGruber, BCYe, FHallett, WANilakantan, RShen, RWang, YFGreenberger, LMTsou, HR Synthesis and structure-activity relationships of 6,7-disubstituted 4-anilinoquinoline-3-carbonitriles. The design of an orally active, irreversible inhibitor of the tyrosine kinase activity of the epidermal growth factor receptor (EGFR) and the human epidermal growth factor receptor-2 (HER-2). J Med Chem46:49-63 (2002) 
 
Epidermal growth factor receptor
Name:Epidermal growth factor receptor
Type:Receptor Kinase Domain
Mol. Mass.:134279.59
Organism:Homo sapiens (Human)
Description:P00533
Residue:1210
BDBM50122580
NameBDBM50122580
Synonyms:CHEMBL114392 | N-[4-(3-Chloro-4-fluoro-phenylamino)-3-cyano-quinolin-6-yl]-2-morpholin-4-ylmethyl-acrylamide
TypeSmall organic molecule
Emp. Form.C24H21ClFN5O2
Mol. Mass.465.907
SMILESFc1ccc(Nc2c(cnc3ccc(NC(=O)C(=C)CN4CCOCC4)cc23)C#N)cc1Cl