Reaction Details
TargetCytochrome P450 2D3
LigandBDBM50122614
Substrate/Competitorn/a
Meas. Tech.ChEMBL_51711 (CHEMBL665726)
IC50 862000±n/a nM
Citation Venhorst, Jter Laak, AMCommandeur, JNFunae, YHiroi, TVermeulen, NP Homology modeling of rat and human cytochrome P450 2D (CYP2D) isoforms and computational rationalization of experimental ligand-binding specificities. J Med Chem46:74-86 (2002) 
 
Cytochrome P450 2D3
Name:Cytochrome P450 2D3
Type:PROTEIN
Mol. Mass.:56643.68
Organism:Rattus norvegicus
Description:ChEMBL_51711
Residue:500
BDBM50122614
NameBDBM50122614
Synonyms:4-Dimethylaminomethyl-7-methoxy-chromen-2-one | CHEMBL355539
TypeSmall organic molecule
Emp. Form.C13H15NO3
Mol. Mass.233.2631
SMILESCOc1ccc2c(CN(C)C)cc(=O)oc2c1