Reaction Details
TargetCytochrome P450 2D6
LigandBDBM50366613
Substrate/Competitorn/a
Meas. Tech.ChEMBL_51716 (CHEMBL663531)
IC50 1800±n/a nM
Citation Venhorst, Jter Laak, AMCommandeur, JNFunae, YHiroi, TVermeulen, NP Homology modeling of rat and human cytochrome P450 2D (CYP2D) isoforms and computational rationalization of experimental ligand-binding specificities. J Med Chem46:74-86 (2002) 
 
Cytochrome P450 2D6
Name:Cytochrome P450 2D6
Type:Protein
Mol. Mass.:55774.82
Organism:Homo sapiens (Human)
Description:P10635
Residue:497
BDBM50366613
NameBDBM50366613
Synonyms:DEXTROMETHORPHAN
TypeSmall organic molecule
Emp. Form.C18H25NO
Mol. Mass.271.3972
SMILESCOc1ccc2C[C@H]3[C@H]4CCCC[C@@]4(CCN3C)c2c1