Reaction Details
TargetCytochrome P450 2D26
LigandBDBM50122615
Substrate/Competitorn/a
Meas. Tech.ChEMBL_51710 (CHEMBL665725)
IC50 66400±n/a nM
Citation Venhorst, Jter Laak, AMCommandeur, JNFunae, YHiroi, TVermeulen, NP Homology modeling of rat and human cytochrome P450 2D (CYP2D) isoforms and computational rationalization of experimental ligand-binding specificities. J Med Chem46:74-86 (2002) 
 
Cytochrome P450 2D26
Name:Cytochrome P450 2D26
Type:PROTEIN
Mol. Mass.:56689.75
Organism:Rattus norvegicus
Description:ChEMBL_51710
Residue:500
BDBM50122615
NameBDBM50122615
Synonyms:CHEMBL2373353 | Dodecahydro-7,14-methano-dipyrido[1,2-a;1',2'-e][1,5]diazocine
TypeSmall organic molecule
Emp. Form.C15H26N2
Mol. Mass.234.3803
SMILES[H][C@]12CN3CCCCC3[C@]([H])(CN3CCCCC13)C2