Reaction Details
TargetCytochrome P450 2D4
LigandBDBM50367247
Substrate/Competitorn/a
Meas. Tech.ChEMBL_51712 (CHEMBL665727)
IC50 1700±n/a nM
Citation Venhorst, Jter Laak, AMCommandeur, JNFunae, YHiroi, TVermeulen, NP Homology modeling of rat and human cytochrome P450 2D (CYP2D) isoforms and computational rationalization of experimental ligand-binding specificities. J Med Chem46:74-86 (2002) 
 
Cytochrome P450 2D4
Name:Cytochrome P450 2D4
Type:PROTEIN
Mol. Mass.:56689.73
Organism:Rattus norvegicus
Description:ChEMBL_1280215
Residue:500
BDBM50367247
NameBDBM50367247
Synonyms:QUININE Quinsan | cid_3034034
TypeSmall organic molecule
Emp. Form.C20H24N2O2
Mol. Mass.324.4168
SMILESCOc1ccc2nccc([C@@H](O)[C@@H]3C[C@@H]4CCN3C[C@@H]4C=C)c2c1