Reaction Details
TargetCytochrome P450 2D1
LigandBDBM36108
Substrate/Competitorn/a
Meas. Tech.ChEMBL_51708 (CHEMBL665723)
IC50 182000±n/a nM
Citation Venhorst, Jter Laak, AMCommandeur, JNFunae, YHiroi, TVermeulen, NP Homology modeling of rat and human cytochrome P450 2D (CYP2D) isoforms and computational rationalization of experimental ligand-binding specificities. J Med Chem46:74-86 (2002) 
 
Cytochrome P450 2D1
Name:Cytochrome P450 2D1
Type:PROTEIN
Mol. Mass.:57179.81
Organism:Rattus norvegicus
Description:ChEMBL_51708
Residue:504
BDBM36108
NameBDBM36108
Synonyms:(R)-propranolol
TypeGuest
Emp. Form.C16H22NO2
Mol. Mass.260.3508
SMILESCC(C)[NH2+]C[C@@H](O)COc1cccc2ccccc12