Reaction Details
TargetB1 bradykinin receptor
LigandBDBM50370217
Substrate/Competitorn/a
Meas. Tech.ChEMBL_40137 (CHEMBL656789)
IC50 27±n/a nM
Citation Wood, MRKim, JJHan, WDorsey, BDHomnick, CFDiPardo, RMKuduk, SDMacNeil, TMurphy, KLLis, EVRansom, RWStump, GLLynch, JJO'Malley, SSMiller, PJChen, TBHarrell, CMChang, RSSandhu, PEllis, JDBondiskey, PJPettibone, DJFreidinger, RMBock, MG Benzodiazepines as potent and selective bradykinin B1 antagonists. J Med Chem46:1803-6 (2003) 
 
B1 bradykinin receptor
Name:B1 bradykinin receptor
Type:Enzyme Catalytic Domain
Mol. Mass.:38389.97
Organism:RAT
Description:B1 BRADYKININ BDKRB1 RAT::P97583
Residue:337
BDBM50370217
NameBDBM50370217
Synonyms:CHEMBL1744085
TypeSmall organic molecule
Emp. Form.C36H44N6O2
Mol. Mass.592.7736
SMILESCCCN1c2ccccc2C(=N[C@@H](NC(=O)Nc2ccc(cc2)N2CCC(CC2)N2CCCCC2)C1=O)c1ccc(C)cc1