Reaction Details
TargetReverse transcriptase/RNaseH
LigandBDBM50127513
Substrate/Competitorn/a
Meas. Tech.ChEMBL_195507 (CHEMBL798928)
IC50 6700±n/a nM
Citation Hyde, RMBroom, ADBuckheit, RW Antiviral amphipathic oligo- and polyribonucleotides: analogue development and biological studies. J Med Chem46:1878-85 (2003) 
 
Reverse transcriptase/RNaseH
Name:Reverse transcriptase/RNaseH
Type:PROTEIN
Mol. Mass.:65229.15
Organism:Human immunodeficiency virus 1
Description:ChEMBL_1473730
Residue:566
BDBM50127513
NameBDBM50127513
Synonyms:(2R,3S,5R)-4-methoxy-2-(methoxymethyl)-5-(6-oxo-1-propyl-6,9-dihydro-1H-purin-9-yl)oxolan-3-yl methylphosphonate | oligonucleotide
TypeSmall organic molecule
Emp. Form.C16H24N4O7P
Mol. Mass.415.3587
SMILESCCCn1cnc2n(cnc2c1=O)[C@@H]1O[C@H](COC)[C@H](OP(C)([O-])=O)C1OC