Reaction Details
TargetBeta-secretase 1
LigandBDBM50128038
Substrate/Competitorn/a
Meas. Tech.ChEMBL_39223 (CHEMBL655069)
Ki 8±n/a nM
Citation Tounge, BAReynolds, CH Calculation of the binding affinity of beta-secretase inhibitors using the linear interaction energy method. J Med Chem46:2074-82 (2003) 
 
Beta-secretase 1
Name:Beta-secretase 1
Type:Protein
Mol. Mass.:55755.10
Organism:Homo sapiens (Human)
Description:P56817
Residue:501
BDBM50128038
NameBDBM50128038
Synonyms:((S)-1-{1-[(S)-4-(1-Benzylcarbamoyl-2-methyl-propylcarbamoyl)-2-hydroxy-1-isobutyl-pentylcarbamoyl]-3-methanesulfonyl-propylcarbamoyl}-2-methyl-propyl)-carbamic acid tert-butyl ester CHEMBL440490
TypeSmall organic molecule
Emp. Form.C37H63N5O9S
Mol. Mass.753.989
SMILESCC(C)C[C@H](NC(=O)C(CCS(C)(=O)=O)NC(=O)[C@@H](NC(=O)OC(C)(C)C)C(C)C)C(O)CC(C)C(=O)NC(C(C)C)C(=O)NCc1ccccc1