Reaction Details
TargetDelta-type opioid receptor
LigandBDBM50128084
Substrate/Competitorn/a
Meas. Tech.ChEMBL_146316 (CHEMBL758863)
Ki 9.1±n/a nM
Citation Schlechtingen, GDeHaven, RNDaubert, JDCassel, JAChung, NNSchiller, PWTaulane, JPGoodman, M Structure-activity relationships of dynorphin a analogues modified in the address sequence. J Med Chem46:2104-9 (2003) 
 
Delta-type opioid receptor
Name:Delta-type opioid receptor
Type:G Protein-Coupled Receptor (GPCR)
Mol. Mass.:40382.98
Organism:Homo sapiens (Human)
Description:Competition binding assays were carried out using membrane preparations from transfected HN9.10 cells that constitutively expressed the delta opioid receptor.
Residue:372
BDBM50128084
NameBDBM50128084
Synonyms:CHEMBL63188 | Tyr-Gly-Gly-Phe-Leu-Arg-OH
TypeSmall organic molecule
Emp. Form.C34H49N9O8
Mol. Mass.711.8084
SMILESCC(C)C[C@H](NC(=O)[C@H](Cc1ccccc1)NC(=O)CNC(=O)CNC(=O)[C@@H](N)Cc1ccc(O)cc1)C(=O)N[C@@H](CCCNC(N)=N)C(O)=O