Reaction Details
TargetMu-type opioid receptor
LigandBDBM50128074
Substrate/Competitorn/a
Meas. Tech.ChEMBL_148222 (CHEMBL754712)
Ki 12±n/a nM
Citation Schlechtingen, GDeHaven, RNDaubert, JDCassel, JAChung, NNSchiller, PWTaulane, JPGoodman, M Structure-activity relationships of dynorphin a analogues modified in the address sequence. J Med Chem46:2104-9 (2003) 
 
Mu-type opioid receptor
Name:Mu-type opioid receptor
Type:G Protein-Coupled Receptor (GPCR)
Mol. Mass.:44789.51
Organism:Homo sapiens (Human)
Description:P35372
Residue:400
BDBM50128074
NameBDBM50128074
Synonyms:CHEMBL269483 | Tyr-Gly-Gly-Phe-Leu-Arg-Arg-Ile-Arg-Pro-OH
TypeSmall organic molecule
Emp. Form.C57H91N19O12
Mol. Mass.1234.4525
SMILESCC[C@H](C)[C@H](NC(=O)[C@H](CCCNC(N)=N)NC(=O)[C@H](CCCNC(N)=N)NC(=O)[C@H](CC(C)C)NC(=O)[C@H](Cc1ccccc1)NC(=O)CNC(=O)CNC(=O)[C@@H](N)Cc1ccc(O)cc1)C(=O)N[C@@H](CCCNC(N)=N)C(=O)N1CCC[C@@H]1C(O)=O