Reaction Details
TargetKappa-type opioid receptor
LigandBDBM50128075
Substrate/Competitorn/a
Meas. Tech.ChEMBL_145252 (CHEMBL751030)
Ki>1000±n/a nM
Citation Schlechtingen, GDeHaven, RNDaubert, JDCassel, JAChung, NNSchiller, PWTaulane, JPGoodman, M Structure-activity relationships of dynorphin a analogues modified in the address sequence. J Med Chem46:2104-9 (2003) 
 
Kappa-type opioid receptor
Name:Kappa-type opioid receptor
Type:G Protein-Coupled Receptor (GPCR)
Mol. Mass.:42648.76
Organism:Homo sapiens (Human)
Description:P41145
Residue:380
BDBM50128075
NameBDBM50128075
Synonyms:CHEMBL218452 Leu-enkephalin Tyr-Gly-Pro-Phe-Leu-Arg-Arg-Ile-Arg-Arg-Lys-NH2
TypeSmall organic molecule
Emp. Form.C28H37N5O7
Mol. Mass.555.6227
SMILESCC(C)C[C@H](NC(=O)[C@H](Cc1ccccc1)NC(=O)CNC(=O)CNC(=O)[C@@H](N)Cc1ccc(O)cc1)C(O)=O