Reaction Details
TargetMu-type opioid receptor
LigandBDBM50128073
Substrate/Competitorn/a
Meas. Tech.ChEMBL_148222 (CHEMBL754712)
Ki 6030±n/a nM
Citation Schlechtingen, GDeHaven, RNDaubert, JDCassel, JAChung, NNSchiller, PWTaulane, JPGoodman, M Structure-activity relationships of dynorphin a analogues modified in the address sequence. J Med Chem46:2104-9 (2003) 
 
Mu-type opioid receptor
Name:Mu-type opioid receptor
Type:G Protein-Coupled Receptor (GPCR)
Mol. Mass.:44789.51
Organism:Homo sapiens (Human)
Description:P35372
Residue:400
BDBM50128073
NameBDBM50128073
Synonyms:CHEMBL2369365 | Tyr-Gly-Pro-Phe-Leu-Arg-Arg-Ile-Arg-Arg-NH2
TypeSmall organic molecule
Emp. Form.C61H101N23O11
Mol. Mass.1332.6021
SMILES[#6]-[#6]-[#6@H](-[#6])-[#6@H](-[#7]-[#6](=O)-[#6@H](-[#6]-[#6]-[#6]\[#7]=[#6](\[#7])-[#7])-[#7]-[#6](=O)-[#6@H](-[#6]-[#6]-[#6]\[#7]=[#6](\[#7])-[#7])-[#7]-[#6](=O)-[#6@H](-[#6]-[#6](-[#6])-[#6])-[#7]-[#6](=O)-[#6@H](-[#6]-c1ccccc1)-[#7]-[#6](=O)-[#6@@H]-1-[#6]-[#6]-[#6]-[#7]-1-[#6](=O)-[#6]-[#7]-[#6](=O)-[#6@@H](-[#7])-[#6]-c1ccc(-[#8])cc1)-[#6](=O)-[#7]-[#6@@H](-[#6]-[#6]-[#6]\[#7]=[#6](\[#7])-[#7])-[#6](=O)-[#7]-[#6@H](-[#6]-[#6]-[#6]\[#7]=[#6](/[#7])-[#7])-[#6](-[#7])=O