Reaction Details
TargetKappa-type opioid receptor
LigandBDBM50128087
Substrate/Competitorn/a
Meas. Tech.ChEMBL_145252 (CHEMBL751030)
Ki 16200±n/a nM
Citation Schlechtingen, GDeHaven, RNDaubert, JDCassel, JAChung, NNSchiller, PWTaulane, JPGoodman, M Structure-activity relationships of dynorphin a analogues modified in the address sequence. J Med Chem46:2104-9 (2003) 
 
Kappa-type opioid receptor
Name:Kappa-type opioid receptor
Type:G Protein-Coupled Receptor (GPCR)
Mol. Mass.:42648.76
Organism:Homo sapiens (Human)
Description:P41145
Residue:380
BDBM50128087
NameBDBM50128087
Synonyms:CHEMBL2369395 | Tyr-Gly-Pro-Phe-Leu-Arg-Arg-Ile-Arg-Pro-NH2
TypeSmall organic molecule
Emp. Form.C49H77N15O9
Mol. Mass.1020.2308
SMILES[#6]-[#6]-[#6@H](-[#6])-[#6@H](-[#7]-[#6](=O)-[#6@H](-[#6]-[#6]-[#6]\[#7]=[#6](\[#7])-[#7])-[#7]-[#6](=O)-[#6@H](-[#6]-[#6]-[#6]\[#7]=[#6](\[#7])-[#7])-[#7]-[#6](=O)-[#6@H](-[#6]-[#6](-[#6])-[#6])-[#7]-[#6](=O)-[#6@H](-[#6]-c1ccccc1)-[#7]-[#6](=O)-[#6@@H]-1-[#6]-[#6]-[#6]-[#7]-1-[#6](=O)-[#6]-[#7]-[#6](=O)-[#6@@H](-[#7])-[#6]-c1ccc(-[#8])cc1)-[#6](-[#7])=O