Reaction Details
TargetCannabinoid receptor 1
LigandBDBM50272598
Substrate/Competitorn/a
Meas. Tech.ChEMBL_46450 (CHEMBL657898)
Ki 16±n/a nM
Citation Wrobleski, STChen, PHynes, JLin, SNorris, DJPandit, CRSpergel, SWu, HTokarski, JSChen, XGillooly, KMKiener, PAMcIntyre, KWPatil-Koota, VShuster, DJTurk, LAYang, GLeftheris, K Rational design and synthesis of an orally active indolopyridone as a novel conformationally constrained cannabinoid ligand possessing antiinflammatory properties. J Med Chem46:2110-6 (2003) 
 
Cannabinoid receptor 1
Name:Cannabinoid receptor 1
Type:G Protein-Coupled Receptor (GPCR)
Mol. Mass.:52868.96
Organism:Homo sapiens (Human)
Description:P21554
Residue:472
BDBM50272598
NameBDBM50272598
Synonyms:6-Methoxy-5-(2-morpholin-4-yl-ethyl)-2-(1,3,3-trimethyl-bicyclo[2.2.1]hept-2-yl)-2,5-dihydro-pyrido[4,3-b]indol-1-one CHEMBL527031
TypeSmall organic molecule
Emp. Form.C28H37N3O3
Mol. Mass.463.6117
SMILESCOc1cccc2c1n(CCN1CCOCC1)c1ccn([C@H]3[C@@]4(C)CC[C@H](C4)C3(C)C)c(=O)c21