Reaction Details
TargetSigma non-opioid intracellular receptor 1
LigandBDBM50128105
Substrate/Competitorn/a
Meas. Tech.ChEMBL_201912 (CHEMBL808202)
Ki 1.81±n/a nM
Citation Berardi, FLoiodice, FFracchiolla, GColabufo, NAPerrone, RTortorella, V Synthesis of chiral 1-[omega-(4-chlorophenoxy)alkyl]-4-methylpiperidines and their biological evaluation at sigma1, sigma2, and sterol delta8-delta7 isomerase sites. J Med Chem46:2117-24 (2003) 
 
Sigma non-opioid intracellular receptor 1
Name:Sigma non-opioid intracellular receptor 1
Type:Enzyme Catalytic Domain
Mol. Mass.:25124.85
Organism:Homo sapiens (Human)
Description:Q99720
Residue:223
BDBM50128105
NameBDBM50128105
Synonyms:1-[2-(4-Chloro-phenoxy)-propyl]-4-methyl-piperidine; hydrochloride | CHEMBL542392
TypeSmall organic molecule
Emp. Form.C15H22ClNO
Mol. Mass.267.794
SMILESC[C@H](CN1CCC(C)CC1)Oc1ccc(Cl)cc1