Reaction Details
TargetSigma non-opioid intracellular receptor 1
LigandBDBM50128110
Substrate/Competitorn/a
Meas. Tech.ChEMBL_201912 (CHEMBL808202)
Ki 0.860±n/a nM
Citation Berardi, FLoiodice, FFracchiolla, GColabufo, NAPerrone, RTortorella, V Synthesis of chiral 1-[omega-(4-chlorophenoxy)alkyl]-4-methylpiperidines and their biological evaluation at sigma1, sigma2, and sterol delta8-delta7 isomerase sites. J Med Chem46:2117-24 (2003) 
 
Sigma non-opioid intracellular receptor 1
Name:Sigma non-opioid intracellular receptor 1
Type:Enzyme Catalytic Domain
Mol. Mass.:25124.85
Organism:Homo sapiens (Human)
Description:Q99720
Residue:223
BDBM50128110
NameBDBM50128110
Synonyms:1-[2-(4-Chloro-phenoxy)-ethyl]-4-methyl-piperidine; hydrochloride | CHEMBL543821
TypeSmall organic molecule
Emp. Form.C14H20ClNO
Mol. Mass.253.768
SMILESCC1CCN(CCOc2ccc(Cl)cc2)CC1