Reaction Details
Target3-beta-hydroxysteroid-Delta(8),Delta(7)-isomerase
LigandBDBM50128112
Substrate/Competitorn/a
Meas. Tech.ChEMBL_203193 (CHEMBL804438)
Ki 9.65±n/a nM
Citation Berardi, FLoiodice, FFracchiolla, GColabufo, NAPerrone, RTortorella, V Synthesis of chiral 1-[omega-(4-chlorophenoxy)alkyl]-4-methylpiperidines and their biological evaluation at sigma1, sigma2, and sterol delta8-delta7 isomerase sites. J Med Chem46:2117-24 (2003) 
 
3-beta-hydroxysteroid-Delta(8),Delta(7)-isomerase
Name:3-beta-hydroxysteroid-Delta(8),Delta(7)-isomerase
Type:PROTEIN
Mol. Mass.:26684.52
Organism:Cavia porcellus
Description:ChEMBL_203193
Residue:229
BDBM50128112
NameBDBM50128112
Synonyms:1-[3-(4-Chloro-phenoxy)-propyl]-4-methyl-piperidine; hydrochloride | CHEMBL540289
TypeSmall organic molecule
Emp. Form.C15H22ClNO
Mol. Mass.267.794
SMILESCC1CCN(CCCOc2ccc(Cl)cc2)CC1