Reaction Details
TargetSigma non-opioid intracellular receptor 1
LigandBDBM50128103
Substrate/Competitorn/a
Meas. Tech.ChEMBL_201912 (CHEMBL808202)
Ki 2.21±n/a nM
Citation Berardi, FLoiodice, FFracchiolla, GColabufo, NAPerrone, RTortorella, V Synthesis of chiral 1-[omega-(4-chlorophenoxy)alkyl]-4-methylpiperidines and their biological evaluation at sigma1, sigma2, and sterol delta8-delta7 isomerase sites. J Med Chem46:2117-24 (2003) 
 
Sigma non-opioid intracellular receptor 1
Name:Sigma non-opioid intracellular receptor 1
Type:Enzyme Catalytic Domain
Mol. Mass.:25124.85
Organism:Homo sapiens (Human)
Description:Q99720
Residue:223
BDBM50128103
NameBDBM50128103
Synonyms:1-[3-(4-Chloro-phenoxy)-1-methyl-propyl]-4-methyl-piperidine; hydrochloride | CHEMBL545691
TypeSmall organic molecule
Emp. Form.C16H24ClNO
Mol. Mass.281.821
SMILESC[C@H](CCOc1ccc(Cl)cc1)N1CCC(C)CC1