Reaction Details
Target3-beta-hydroxysteroid-Delta(8),Delta(7)-isomerase
LigandBDBM50128110
Substrate/Competitorn/a
Meas. Tech.ChEMBL_203193 (CHEMBL804438)
Ki 3.7±n/a nM
Citation Berardi, FLoiodice, FFracchiolla, GColabufo, NAPerrone, RTortorella, V Synthesis of chiral 1-[omega-(4-chlorophenoxy)alkyl]-4-methylpiperidines and their biological evaluation at sigma1, sigma2, and sterol delta8-delta7 isomerase sites. J Med Chem46:2117-24 (2003) 
 
3-beta-hydroxysteroid-Delta(8),Delta(7)-isomerase
Name:3-beta-hydroxysteroid-Delta(8),Delta(7)-isomerase
Type:PROTEIN
Mol. Mass.:26684.52
Organism:Cavia porcellus
Description:ChEMBL_203193
Residue:229
BDBM50128110
NameBDBM50128110
Synonyms:1-[2-(4-Chloro-phenoxy)-ethyl]-4-methyl-piperidine; hydrochloride | CHEMBL543821
TypeSmall organic molecule
Emp. Form.C14H20ClNO
Mol. Mass.253.768
SMILESCC1CCN(CCOc2ccc(Cl)cc2)CC1