Reaction Details
TargetCarbonic anhydrase 2
LigandBDBM50128221
Substrate/Competitorn/a
Meas. Tech.ChEMBL_45235 (CHEMBL657193)
Ki 2.9±n/a nM
Citation Winum, JYVullo, DCasini, AMontero, JLScozzafava, ASupuran, CT Carbonic anhydrase inhibitors. Inhibition of cytosolic isozymes I and II and transmembrane, tumor-associated isozyme IX with sulfamates including EMATE also acting as steroid sulfatase inhibitors. J Med Chem46:2197-204 (2003) 
 
Carbonic anhydrase 2
Name:Carbonic anhydrase 2
Type:Enzyme
Mol. Mass.:29250.71
Organism:Homo sapiens (Human)
Description:P00918
Residue:260
BDBM50128221
NameBDBM50128221
Synonyms:CHEMBL69948 | Sulfamic acid 4-tert-butyl-phenyl ester
TypeSmall organic molecule
Emp. Form.C10H15NO3S
Mol. Mass.229.296
SMILESCC(C)(C)c1ccc(OS(N)(=O)=O)cc1