Reaction Details
TargetSteroid 17-alpha-hydroxylase/17,20 lyase
LigandBDBM50128547
Substrate/Competitorn/a
Meas. Tech.ChEMBL_50527 (CHEMBL661144)
IC50 3700±n/a nM
Citation Clement, OOFreeman, CMHartmann, RWHandratta, VDVasaitis, TSBrodie, AMNjar, VC Three dimensional pharmacophore modeling of human CYP17 inhibitors. Potential agents for prostate cancer therapy. J Med Chem46:2345-51 (2003) 
 
Steroid 17-alpha-hydroxylase/17,20 lyase
Name:Steroid 17-alpha-hydroxylase/17,20 lyase
Type:Enzyme
Mol. Mass.:57382.42
Organism:Homo sapiens (Human)
Description:E.coli expressing human CYP17
Residue:508
BDBM50128547
NameBDBM50128547
Synonyms:(3S,10R,13S)-10,13-Dimethyl-17-[1,2,3]triazol-2-yl-2,3,4,7,8,9,10,11,12,13,14,15-dodecahydro-1H-cyclopenta[a]phenanthren-3-ol | CHEMBL307050
TypeSmall organic molecule
Emp. Form.C21H29N3O
Mol. Mass.339.4745
SMILESC[C@]12CCC3C(CC=C4C[C@@H](O)CC[C@]34C)C1CC=C2n1nccn1