Reaction Details
TargetSteroid 17-alpha-hydroxylase/17,20 lyase
LigandBDBM50128554
Substrate/Competitorn/a
Meas. Tech.ChEMBL_50523 (CHEMBL661140)
Ki 610±n/a nM
Citation Clement, OOFreeman, CMHartmann, RWHandratta, VDVasaitis, TSBrodie, AMNjar, VC Three dimensional pharmacophore modeling of human CYP17 inhibitors. Potential agents for prostate cancer therapy. J Med Chem46:2345-51 (2003) 
 
Steroid 17-alpha-hydroxylase/17,20 lyase
Name:Steroid 17-alpha-hydroxylase/17,20 lyase
Type:Enzyme
Mol. Mass.:57382.42
Organism:Homo sapiens (Human)
Description:E.coli expressing human CYP17
Residue:508
BDBM50128554
NameBDBM50128554
Synonyms:1-(2,6-Dichloro-phenyl)-2-(2,4-dichloro-phenyl)-3-imidazol-1-yl-propan-2-ol | CHEMBL77990
TypeSmall organic molecule
Emp. Form.C18H14Cl4N2O
Mol. Mass.416.129
SMILESOC(Cc1c(Cl)cccc1Cl)(Cn1ccnc1)c1ccc(Cl)cc1Cl