Reaction Details
TargetSteroid 17-alpha-hydroxylase/17,20 lyase
LigandBDBM50128556
Substrate/Competitorn/a
Meas. Tech.ChEMBL_50527 (CHEMBL661144)
IC50 616.50±n/a nM
Citation Clement, OOFreeman, CMHartmann, RWHandratta, VDVasaitis, TSBrodie, AMNjar, VC Three dimensional pharmacophore modeling of human CYP17 inhibitors. Potential agents for prostate cancer therapy. J Med Chem46:2345-51 (2003) 
 
Steroid 17-alpha-hydroxylase/17,20 lyase
Name:Steroid 17-alpha-hydroxylase/17,20 lyase
Type:Enzyme
Mol. Mass.:57382.42
Organism:Homo sapiens (Human)
Description:E.coli expressing human CYP17
Residue:508
BDBM50128556
NameBDBM50128556
Synonyms:(R)-4-((3S,10R)-3-Hydroxy-10-methyl-2,3,4,7,8,9,10,11,12,13,14,15,16,17-tetradecahydro-1H-cyclopenta[a]phenanthren-17-yl)-pentanoic acid bicyclo[3.2.1]oct-3-en-6-yl ester | CHEMBL80216
TypeSmall organic molecule
Emp. Form.C31H46O3
Mol. Mass.466.6951
SMILESCC(CCC(=O)OC1CC2CC1C=CC2)[C@H]1CCC2C1CCC1C2CC=C2C[C@@H](O)CC[C@]12C