Reaction Details
TargetSteroid 17-alpha-hydroxylase/17,20 lyase
LigandBDBM50097370
Substrate/Competitorn/a
Meas. Tech.ChEMBL_50520 (CHEMBL661137)
IC50 42±n/a nM
Citation Clement, OOFreeman, CMHartmann, RWHandratta, VDVasaitis, TSBrodie, AMNjar, VC Three dimensional pharmacophore modeling of human CYP17 inhibitors. Potential agents for prostate cancer therapy. J Med Chem46:2345-51 (2003) 
 
Steroid 17-alpha-hydroxylase/17,20 lyase
Name:Steroid 17-alpha-hydroxylase/17,20 lyase
Type:Enzyme
Mol. Mass.:57382.42
Organism:Homo sapiens (Human)
Description:E.coli expressing human CYP17
Residue:508
BDBM50097370
NameBDBM50097370
Synonyms:1-((1H-imidazol-1-yl)methyl)-4-bromo-9H-xanthen-9-one CHEMBL78322
TypeSmall organic molecule
Emp. Form.C17H11BrN2O2
Mol. Mass.355.185
SMILESBrc1ccc(Cn2ccnc2)c2c1oc1ccccc1c2=O