Reaction Details
TargetSteroid 17-alpha-hydroxylase/17,20 lyase
LigandBDBM50128565
Substrate/Competitorn/a
Meas. Tech.ChEMBL_50527 (CHEMBL661144)
IC50 225±n/a nM
Citation Clement, OOFreeman, CMHartmann, RWHandratta, VDVasaitis, TSBrodie, AMNjar, VC Three dimensional pharmacophore modeling of human CYP17 inhibitors. Potential agents for prostate cancer therapy. J Med Chem46:2345-51 (2003) 
 
Steroid 17-alpha-hydroxylase/17,20 lyase
Name:Steroid 17-alpha-hydroxylase/17,20 lyase
Type:Enzyme
Mol. Mass.:57382.42
Organism:Homo sapiens (Human)
Description:E.coli expressing human CYP17
Residue:508
BDBM50128565
NameBDBM50128565
Synonyms:(3S,10R,13S,17R)-10,13-Dimethyl-17-pyrimidin-4-yl-2,3,4,7,8,9,10,11,12,13,14,15,16,17-tetradecahydro-1H-cyclopenta[a]phenanthren-3-ol | CHEMBL305896
TypeSmall organic molecule
Emp. Form.C23H32N2O
Mol. Mass.352.513
SMILESC[C@]12CCC3C(CC=C4C[C@@H](O)CC[C@]34C)C1CC[C@H]2c1ccncn1