Reaction Details
TargetSteroid 17-alpha-hydroxylase/17,20 lyase
LigandBDBM50097363
Substrate/Competitorn/a
Meas. Tech.ChEMBL_50520 (CHEMBL661137)
IC50 130±n/a nM
Citation Clement, OOFreeman, CMHartmann, RWHandratta, VDVasaitis, TSBrodie, AMNjar, VC Three dimensional pharmacophore modeling of human CYP17 inhibitors. Potential agents for prostate cancer therapy. J Med Chem46:2345-51 (2003) 
 
Steroid 17-alpha-hydroxylase/17,20 lyase
Name:Steroid 17-alpha-hydroxylase/17,20 lyase
Type:Enzyme
Mol. Mass.:57382.42
Organism:Homo sapiens (Human)
Description:E.coli expressing human CYP17
Residue:508
BDBM50097363
NameBDBM50097363
Synonyms:1-((1H-imidazol-1-yl)methyl)-4-nitro-9H-xanthen-9-one CHEMBL307160
TypeSmall organic molecule
Emp. Form.C17H11N3O4
Mol. Mass.321.2869
SMILES[O-][N+](=O)c1ccc(Cn2ccnc2)c2c1oc1ccccc1c2=O