Reaction Details
TargetSteroid 17-alpha-hydroxylase/17,20 lyase
LigandBDBM50409695
Substrate/Competitorn/a
Meas. Tech.ChEMBL_50527 (CHEMBL661144)
IC50 1700±n/a nM
Citation Clement, OOFreeman, CMHartmann, RWHandratta, VDVasaitis, TSBrodie, AMNjar, VC Three dimensional pharmacophore modeling of human CYP17 inhibitors. Potential agents for prostate cancer therapy. J Med Chem46:2345-51 (2003) 
 
Steroid 17-alpha-hydroxylase/17,20 lyase
Name:Steroid 17-alpha-hydroxylase/17,20 lyase
Type:Enzyme
Mol. Mass.:57382.42
Organism:Homo sapiens (Human)
Description:E.coli expressing human CYP17
Residue:508
BDBM50409695
NameBDBM50409695
Synonyms:CHEMBL2112280
TypeSmall organic molecule
Emp. Form.C21H27NO2
Mol. Mass.325.4446
SMILESCC(N=O)C1=CC=C2[C@@H]3CCC4=CC(=O)CC[C@]4(C)[C@H]3CC[C@]12C