Reaction Details
TargetSteroid 17-alpha-hydroxylase/17,20 lyase
LigandBDBM50215709
Substrate/Competitorn/a
Meas. Tech.ChEMBL_50527 (CHEMBL661144)
IC50 56±n/a nM
Citation Clement, OOFreeman, CMHartmann, RWHandratta, VDVasaitis, TSBrodie, AMNjar, VC Three dimensional pharmacophore modeling of human CYP17 inhibitors. Potential agents for prostate cancer therapy. J Med Chem46:2345-51 (2003) 
 
Steroid 17-alpha-hydroxylase/17,20 lyase
Name:Steroid 17-alpha-hydroxylase/17,20 lyase
Type:Enzyme
Mol. Mass.:57382.42
Organism:Homo sapiens (Human)
Description:E.coli expressing human CYP17
Residue:508
BDBM50215709
NameBDBM50215709
Synonyms:CHEMBL1170 Propionic acid 10,13-dimethyl-3-oxo-2,3,6,7,8,9,10,11,12,13,14,15,16,17-tetradecahydro-1H-cyclopenta[a]phenanthren-17-yl ester TESTOSTERONE PROPIONATE | testosteron propionate
TypeSmall organic molecule
Emp. Form.C22H32O3
Mol. Mass.344.4877
SMILESCCC(=O)O[C@H]1CC[C@H]2[C@@H]3CCC4=CC(=O)CC[C@]4(C)[C@H]3CC[C@]12C