Reaction Details
TargetInterstitial collagenase
LigandBDBM50128636
Substrate/Competitorn/a
Meas. Tech.ChEMBL_106291 (CHEMBL714547)
IC50 1390±n/a nM
Citation Aranapakam, VDavis, JMGrosu, GTBaker, JEllingboe, JZask, ALevin, JISandanayaka, VPDu, MSkotnicki, JSDiJoseph, JFSung, ASharr, MAKillar, LMWalter, TJin, GCowling, RTillett, JZhao, WMcDevitt, JXu, ZB Synthesis and structure-activity relationship of N-substituted 4-arylsulfonylpiperidine-4-hydroxamic acids as novel, orally active matrix metalloproteinase inhibitors for the treatment of osteoarthritis. J Med Chem46:2376-96 (2003) 
 
Interstitial collagenase
Name:Interstitial collagenase
Type:Enzyme
Mol. Mass.:54010.26
Organism:Homo sapiens (Human)
Description: P03956
Residue:469
BDBM50128636
NameBDBM50128636
Synonyms:4-(4-Methoxy-benzenesulfonyl)-1-(3-methyl-but-2-enyl)-piperidine-4-carboxylic acid hydroxyamide | CHEMBL310684
TypeSmall organic molecule
Emp. Form.C18H26N2O5S
Mol. Mass.382.474
SMILES[#6]-[#8]-c1ccc(cc1)S(=O)(=O)C1([#6]-[#6]-[#7](-[#6]\[#6]=[#6](\[#6])-[#6])-[#6]-[#6]1)[#6](=O)-[#7]-[#8]